Target
Serine/threonine-protein kinase PAK 4
Ligand
BDBM101545
Substrate
Meas. Tech.
Enzymatic Assay
Ki
16±n/a nM
EC50
4.4±0.0 nM
Citation
 Zhang, JGuo, CBouzida, DDong, LLi, HMarakovits, JTYang, AHong, Y Pyrrolopyrazoles, potent kinase inhibitors US Patent  US8530652 Publication Date 9/10/2013 
Target
Name:
Serine/threonine-protein kinase PAK 4
Synonyms:
KIAA1142 PAK4_HUMAN | p21-Activated kinase 4 (PAK4)
Type:
Protein
Mol. Mass.:
64098.01
Organism:
Homo sapiens (Human)
Description:
O96013
Residue:
591
  
Inhibitor
Name:
BDBM101545
Synonyms:
US8530494, 107 US8530652, 72
Type:
Small organic molecule
Emp. Form.:
C24H30FN7O3
Mol. Mass.:
483.5385
SMILES:
CCOc1ncc(F)c(Nc2[nH]nc3c2CN(C(=O)O[C@H](CN(C)C)c2ccccc2)C3(C)C)n1
: