Target
Beta-secretase 1
Ligand
BDBM102958
Substrate
Meas. Tech.
Time-Resolved FRET Assay
Temperature
303.15±0 K
Ki
30±0.0 nM
IC50
93±0.0 nM
Citation
 Stamford, AWZhu, ZMandal, MWu, YCumming, JNLiu, XLi, GIserloh, U Phenyl-substituted 2-imino-3-methyl pyrrolo pyrimidinone compounds as BACE-1 inhibitors, compositions, and their use US Patent  US8541427 Publication Date 9/24/2013 
Target
Name:
Beta-secretase 1
Synonyms:
ASP2 Aspartyl protease 2 BACE1 Beta-secretase (BACE) Beta-secretase 1 (BACE 1) Beta-secretase 1 (BACE1) Beta-site amyloid precursor protein cleaving enzyme 1 Memapsin-2 beta-Secretase (BACE-1) | beta-Secretase (BACE1)
Type:
Protein
Mol. Mass.:
55755.10
Organism:
Homo sapiens (Human)
Description:
P56817
Residue:
501
  
Inhibitor
Name:
BDBM102958
Synonyms:
US8541427, 29
Type:
Small organic molecule
Emp. Form.:
C19H17F5N6O2
Mol. Mass.:
456.3693
SMILES:
COc1nc(nc(C)c1F)N1C[C@H]2C(=O)N(C)C(N)=N[C@]2(C1)c1c(F)cc(F)c(F)c1F
: