Target
Nitric oxide synthase, endothelial
Ligand
BDBM106715
Substrate
Meas. Tech.
Enzyme Assay
IC50
3.45e+4±n/a nM
Citation
 Maddaford, SRamnauth, JRakhit, SPatman, JRenton, PAnnedi, SC Substituted indole compounds having NOS inhibitory activity US Patent  US8586620 Publication Date 11/19/2013 
Target
Name:
Nitric oxide synthase, endothelial
Synonyms:
Constitutive NOS Endothelial NOS NOS type III NOS3_HUMAN Nitric oxide synthase (inducible and endothelial) Nitric-oxide synthase (endothelial and brain) eNOS
Type:
Enzyme Catalytic Domain
Mol. Mass.:
133297.84
Organism:
Homo sapiens (Human)
Description:
P29474
Residue:
1203
  
Inhibitor
Name:
BDBM106715
Synonyms:
US8586620, 97
Type:
Small organic molecule
Emp. Form.:
C19H22N4S
Mol. Mass.:
338.47
SMILES:
CN1CCC[C@@H]1Cc1c[nH]c2ccc(cc12)N=C(N)c1cccs1
: