Target
Xanthine dehydrogenase/oxidase
Ligand
BDBM108031
Substrate
Meas. Tech.
Xanthine Oxidase Activity
pH
7.6±n/a
Temperature
298.15±n/a K
IC50
6.5e+3± 5e+2 nM
Comments
extracted
Citation
 Nile, SHPark, SW Antioxidant, a-glucosidase and xanthine oxidase inhibitory activity of bioactive compounds from maize (Zea mays L.). Chem Biol Drug Des 83:119-25 (2014)  
Target
Name:
Xanthine dehydrogenase/oxidase
Synonyms:
XDH Xanthine dehydrogenase Xanthine oxidase (XO)
Type:
Protein
Mol. Mass.:
146809.00
Organism:
Bos taurus (Bovine)
Description:
P80457
Residue:
1332
  
Inhibitor
Name:
BDBM108031
Synonyms:
2,4,6-trihydroxybenzoic acid (M3)
Type:
Small organic molecule
Emp. Form.:
C7H6O5
Mol. Mass.:
170.1195
SMILES:
OC(=O)c1c(O)cc(O)cc1O
: