Target
Xanthine dehydrogenase/oxidase
Ligand
BDBM108032
Substrate
Meas. Tech.
Xanthine Oxidase Activity
pH
7.6±n/a
Temperature
298.15±n/a K
IC50
5.5e+3± 4e+2 nM
Comments
extracted
Citation
 Nile, SHPark, SW Antioxidant, a-glucosidase and xanthine oxidase inhibitory activity of bioactive compounds from maize (Zea mays L.). Chem Biol Drug Des 83:119-25 (2014)  
Target
Name:
Xanthine dehydrogenase/oxidase
Synonyms:
XDH Xanthine dehydrogenase Xanthine oxidase (XO)
Type:
Protein
Mol. Mass.:
146809.00
Organism:
Bos taurus (Bovine)
Description:
P80457
Residue:
1332
  
Inhibitor
Name:
BDBM108032
Synonyms:
2-(3,4-dihydroxyphenyl)-5,7-dihydroxy-3-[(2S,3R,4S,5S,6R)-3,4,5-trihydroxy-6-(hydroxymethyl)oxan-2-yl]oxychromen-4-one | Hirsutrin (M6)
Type:
Small orgnaic molecule
Emp. Form.:
C22H22O11
Mol. Mass.:
462.4035
SMILES:
CC[C@H]1O[C@@H](Oc2c(O)c3c(cc(O)cc3=O)oc2-c2ccc(O)c(O)c2)[C@H](O)[C@@H](O)[C@@H]1O
: