Target
Xanthine dehydrogenase/oxidase
Ligand
BDBM108033
Substrate
Meas. Tech.
Xanthine Oxidase Activity
pH
7.6±n/a
Temperature
298.15±n/a K
IC50
8.6e+3± 2e+2 nM
Comments
extracted
Citation
 Nile, SHPark, SW Antioxidant, a-glucosidase and xanthine oxidase inhibitory activity of bioactive compounds from maize (Zea mays L.). Chem Biol Drug Des 83:119-25 (2014)  
Target
Name:
Xanthine dehydrogenase/oxidase
Synonyms:
XDH Xanthine dehydrogenase Xanthine oxidase (XO)
Type:
Protein
Mol. Mass.:
146809.00
Organism:
Bos taurus (Bovine)
Description:
P80457
Residue:
1332
  
Inhibitor
Name:
BDBM108033
Synonyms:
3'-methoxyhirsutrin (M7) | 3‐{[(2S,3R,4S,5S,6R)‐6‐ethyl‐3,4,5‐trihydroxyoxan‐2‐ yl]oxy}‐5,7‐dihydroxy‐2‐(4‐hydroxy‐3‐ methoxyphenyl)‐4H‐chromen‐4‐one
Type:
Small organic molecule
Emp. Form.:
C23H24O11
Mol. Mass.:
476.4301
SMILES:
CC[C@H]1O[C@@H](Oc2c(O)c3c(cc(O)cc3=O)oc2-c2ccc(O)c(OC)c2)[C@H](O)[C@@H](O)[C@@H]1O
: