Target
Xanthine dehydrogenase/oxidase
Ligand
BDBM50347135
Substrate
Meas. Tech.
Xanthine Oxidase Activity
pH
7.6±n/a
Temperature
298.15±n/a K
IC50
7.2e+3± 1e+2 nM
Comments
extracted
Citation
 Nile, SHPark, SW Antioxidant, a-glucosidase and xanthine oxidase inhibitory activity of bioactive compounds from maize (Zea mays L.). Chem Biol Drug Des 83:119-25 (2014)  
Target
Name:
Xanthine dehydrogenase/oxidase
Synonyms:
XDH Xanthine dehydrogenase Xanthine oxidase (XO)
Type:
Protein
Mol. Mass.:
146809.00
Organism:
Bos taurus (Bovine)
Description:
P80457
Residue:
1332
  
Inhibitor
Name:
BDBM50347135
Synonyms:
Cyanidin-3-glucoside (M8) | KUROMANIN
Type:
Small organic molecule
Emp. Form.:
C21H21O11
Mol. Mass.:
449.3843
SMILES:
OCC1OC(Oc2cc3c(cc(O)cc3=[OH+])oc2-c2ccc(O)c(O)c2)C(O)C(O)C1O
: