Target
Xanthine dehydrogenase/oxidase
Ligand
BDBM108035
Substrate
Meas. Tech.
Xanthine Oxidase Activity
pH
7.6±n/a
Temperature
298.15±n/a K
IC50
8.7e+3± 1e+2 nM
Comments
extracted
Citation
 Nile, SHPark, SW Antioxidant, a-glucosidase and xanthine oxidase inhibitory activity of bioactive compounds from maize (Zea mays L.). Chem Biol Drug Des 83:119-25 (2014)  
Target
Name:
Xanthine dehydrogenase/oxidase
Synonyms:
XDH Xanthine dehydrogenase Xanthine oxidase (XO)
Type:
Protein
Mol. Mass.:
146809.00
Organism:
Bos taurus (Bovine)
Description:
P80457
Residue:
1332
  
Inhibitor
Name:
BDBM108035
Synonyms:
5,7‐dihydroxy‐2‐(4‐hydroxy‐3‐methoxyphenyl)‐3‐ {[(2S,3R,4S,5S,6R)‐3,4,5‐trihydroxy‐6‐ (hydroxymethyl)oxan‐2‐yl]oxy}‐1λ⁴‐chromen‐1‐ylium | Peonidin-3-glucoside (M10)
Type:
Small organic molecule
Emp. Form.:
C22H23O11
Mol. Mass.:
463.4109
SMILES:
COc1cc(ccc1O)-c1oc2cc(O)cc(=[OH+])c2cc1OC1OC(CO)C(O)C(O)C1O
: