Target
Xanthine dehydrogenase/oxidase
Ligand
BDBM35440
Substrate
Meas. Tech.
Xanthine Oxidase Activity
pH
7.6±n/a
Temperature
298.15±n/a K
IC50
7.5e+3± 2e+2 nM
Comments
extracted
Citation
 Nile, SHPark, SW Antioxidant, a-glucosidase and xanthine oxidase inhibitory activity of bioactive compounds from maize (Zea mays L.). Chem Biol Drug Des 83:119-25 (2014)  
Target
Name:
Xanthine dehydrogenase/oxidase
Synonyms:
XDH Xanthine dehydrogenase Xanthine oxidase (XO)
Type:
Protein
Mol. Mass.:
146809.00
Organism:
Bos taurus (Bovine)
Description:
P80457
Residue:
1332
  
Inhibitor
Name:
BDBM35440
Synonyms:
ALLOPURINOL SMR000059083 | cid_2094
Type:
Small organic molecule
Emp. Form.:
C5H4N4O
Mol. Mass.:
136.1115
SMILES:
O=c1[nH]cnc2n[nH]cc12
: