Target
Alpha-glucosidase MAL12
Ligand
BDBM4374
Substrate
Meas. Tech.
Alpha-Glucosidase Assay
IC50
9.08e+4±n/a nM
Citation
 Nile, SHPark, SW Antioxidant, a-glucosidase and xanthine oxidase inhibitory activity of bioactive compounds from maize (Zea mays L.). Chem Biol Drug Des 83:119-25 (2014)  
Target
Name:
Alpha-glucosidase MAL12
Synonyms:
α-Glucosidase MAL12_YEAST Maltase | alpha-Glucosidase (α-Glucosidase)
Type:
Protein
Mol. Mass.:
68084.32
Organism:
Saccharomyces cerevisiae
Description:
P53341
Residue:
584
  
Inhibitor
Name:
BDBM4374
Synonyms:
(2E)-3-(4-hydroxyphenyl)prop-2-enoic acid CHEMBL66879 p-Hydroxycinnamic acid (p-HCA) p-hydroxycinnamic acid (M4)
Type:
Small organic molecule
Emp. Form.:
C9H8O3
Mol. Mass.:
164.158
SMILES:
OC(=O)\C=C\c1ccc(O)cc1
: