Target
Alpha-glucosidase MAL12
Ligand
BDBM108033
Substrate
Meas. Tech.
Alpha-Glucosidase Assay
IC50
2.455e+5±n/a nM
Citation
 Nile, SHPark, SW Antioxidant, a-glucosidase and xanthine oxidase inhibitory activity of bioactive compounds from maize (Zea mays L.). Chem Biol Drug Des 83:119-25 (2014)  
Target
Name:
Alpha-glucosidase MAL12
Synonyms:
α-Glucosidase MAL12_YEAST Maltase | alpha-Glucosidase (α-Glucosidase)
Type:
Protein
Mol. Mass.:
68084.32
Organism:
Saccharomyces cerevisiae
Description:
P53341
Residue:
584
  
Inhibitor
Name:
BDBM108033
Synonyms:
3'-methoxyhirsutrin (M7) | 3‐{[(2S,3R,4S,5S,6R)‐6‐ethyl‐3,4,5‐trihydroxyoxan‐2‐ yl]oxy}‐5,7‐dihydroxy‐2‐(4‐hydroxy‐3‐ methoxyphenyl)‐4H‐chromen‐4‐one
Type:
Small organic molecule
Emp. Form.:
C23H24O11
Mol. Mass.:
476.4301
SMILES:
CC[C@H]1O[C@@H](Oc2c(O)c3c(cc(O)cc3=O)oc2-c2ccc(O)c(OC)c2)[C@H](O)[C@@H](O)[C@@H]1O
: