Target
Alpha-glucosidase MAL12
Ligand
BDBM50347135
Substrate
Meas. Tech.
Alpha-Glucosidase Assay
IC50
2.208e+5±n/a nM
Citation
 Nile, SHPark, SW Antioxidant, a-glucosidase and xanthine oxidase inhibitory activity of bioactive compounds from maize (Zea mays L.). Chem Biol Drug Des 83:119-25 (2014)  
Target
Name:
Alpha-glucosidase MAL12
Synonyms:
α-Glucosidase MAL12_YEAST Maltase | alpha-Glucosidase (α-Glucosidase)
Type:
Protein
Mol. Mass.:
68084.32
Organism:
Saccharomyces cerevisiae
Description:
P53341
Residue:
584
  
Inhibitor
Name:
BDBM50347135
Synonyms:
Cyanidin-3-glucoside (M8) | KUROMANIN
Type:
Small organic molecule
Emp. Form.:
C21H21O11
Mol. Mass.:
449.3843
SMILES:
OCC1OC(Oc2cc3c(cc(O)cc3=[OH+])oc2-c2ccc(O)c(O)c2)C(O)C(O)C1O
: