Target
Alpha-glucosidase MAL12
Ligand
BDBM108034
Substrate
Meas. Tech.
Alpha-Glucosidase Assay
IC50
1.982e+5±n/a nM
Citation
 Nile, SHPark, SW Antioxidant, a-glucosidase and xanthine oxidase inhibitory activity of bioactive compounds from maize (Zea mays L.). Chem Biol Drug Des 83:119-25 (2014)  
Target
Name:
Alpha-glucosidase MAL12
Synonyms:
α-Glucosidase MAL12_YEAST Maltase | alpha-Glucosidase (α-Glucosidase)
Type:
Protein
Mol. Mass.:
68084.32
Organism:
Saccharomyces cerevisiae
Description:
P53341
Residue:
584
  
Inhibitor
Name:
BDBM108034
Synonyms:
5,7‐dihydroxy‐2‐(4‐hydroxyphenyl)‐3‐ {[(2S,3R,4S,5S,6R)‐3,4,5‐trihydroxy‐6‐ (hydroxymethyl)oxan‐2‐yl]oxy}‐1λ⁴‐chromen‐1‐ylium | Pelargonidin-3-glucoside (M9)
Type:
Small organic molecule
Emp. Form.:
C21H21O10
Mol. Mass.:
433.3849
SMILES:
OCC1OC(Oc2cc3c(cc(O)cc3=[OH+])oc2-c2ccc(O)cc2)C(O)C(O)C1O
: