Target
Plasma kallikrein
Ligand
BDBM108095
Substrate
Meas. Tech.
Inhibition Assay
Ki
3±0.0 nM
Citation
 Herold, PDaghish, MJelakovic, SLudwig, FReichelt, CSchulze, ASchweinitz, A Trypsin-like serine protease inhibitors, and their preparation and use US Patent  US8598206 Publication Date 12/3/2013 
Target
Name:
Plasma kallikrein
Synonyms:
Fletcher factor KLKB1 Kallikrein Plasma kallikrein heavy chain Plasma prekallikrein
Type:
Protein
Mol. Mass.:
71391.16
Organism:
Homo sapiens (Human)
Description:
P03952
Residue:
638
  
Inhibitor
Name:
BDBM108095
Synonyms:
US8598206, Table 6, 4
Type:
Small organic molecule
Emp. Form.:
C36H46N6O6S
Mol. Mass.:
690.852
SMILES:
NC(=N)c1ccc(CNC(=O)[C@H](CCC2CCNCC2)NC(=O)[C@@H](CCCc2ccccc2)NS(=O)(=O)Cc2cccc(c2)C(O)=O)cc1
: