Target
Transcription initiation factor IIA subunit 1
Ligand
BDBM108095
Substrate
Meas. Tech.
Inhibition Assay
Ki
4400±0.0 nM
Citation
 Herold, PDaghish, MJelakovic, SLudwig, FReichelt, CSchulze, ASchweinitz, A Trypsin-like serine protease inhibitors, and their preparation and use US Patent  US8598206 Publication Date 12/3/2013 
Target
Name:
Transcription initiation factor IIA subunit 1
Synonyms:
GTF2A1 TF2AA_HUMAN | Transcription initiation factor IIA
Type:
Enzyme
Mol. Mass.:
41485.12
Organism:
Homo sapiens (Human)
Description:
P52655
Residue:
376
  
Inhibitor
Name:
BDBM108095
Synonyms:
US8598206, Table 6, 4
Type:
Small organic molecule
Emp. Form.:
C36H46N6O6S
Mol. Mass.:
690.852
SMILES:
NC(=N)c1ccc(CNC(=O)[C@H](CCC2CCNCC2)NC(=O)[C@@H](CCCc2ccccc2)NS(=O)(=O)Cc2cccc(c2)C(O)=O)cc1
: