Target
Serine/threonine-protein kinase PLK2
Ligand
BDBM108214
Substrate
Meas. Tech.
Biochemical Assay
pH
7.9±0
IC50
1.13e+3±n/a nM
Citation
 Caruso, MBeria, IBrasca, MGPosteri, HFachin, G Substituted dihydropteridin-6-one derivatives, process for their preparation and their use as kinase inhibitors US Patent  US8598172 Publication Date 12/3/2013 
Target
Name:
Serine/threonine-protein kinase PLK2
Synonyms:
PLK2 Polo-Like Kinase 2 Serine/threonine-protein kinase PLK2 Serum-inducible kinase
Type:
Serine/threonine-protein kinase
Mol. Mass.:
78259.87
Organism:
Homo sapiens (Human)
Description:
Full-length human PLK2 was expressed as GST-fusion protein using baculovirus expression system. GST-PLK2 was purified by using glutathione sepharose chromatography.
Residue:
685
  
Inhibitor
Name:
BDBM108214
Synonyms:
US8598172, 1
Type:
Small organic molecule
Emp. Form.:
C26H34F3N7O2
Mol. Mass.:
533.5891
SMILES:
CC[C@H]1N(C2CCCC2)c2nc(Nc3cc(ccc3OC(F)(F)F)N3CCN(C)CC3)ncc2N(C)C1=O
: