Target
Aurora kinase A
Ligand
BDBM109209
Substrate
Meas. Tech.
Inhibition Assay Protocol A
Temperature
303.15±n/a K
Ki
0.0155±0.0 nM
IC50
3.88±0.03 nM
Comments
extracted
Citation
 Lavogina, DEnkvist, EViht, KUri, A Long residence times revealed by Aurora A kinase-targeting fluorescent probes derived from inhibitors MLN8237 and VX-689. Chembiochem 15:443-50 (2014)  
Target
Name:
Aurora kinase A
Synonyms:
AIK ARK-1 AURA AURKA_HUMAN Aurora 2 Aurora kinase A (AURKA) Aurora kinase A (Aurora-2) Aurora/IPL1-related kinase 1 Breast tumor-amplified kinase IAK1 STK15 GN Serine/threonine kinase 15 Serine/threonine-protein kinase 6 Serine/threonine-protein kinase aurora-A aurora-2 | hARK1
Type:
Serine/threonine-protein kinase
Mol. Mass.:
45830.98
Organism:
Homo sapiens (Human)
Description:
O14965
Residue:
403
  
Inhibitor
Name:
BDBM109209
Synonyms:
VX-689
Type:
Small organic molecule
Emp. Form.:
C22H21ClFN3O3S
Mol. Mass.:
461.937
SMILES:
OC(=O)[C@]1(Cc2cccc(Nc3nccs3)n2)CCC(CC1)Oc1cccc(Cl)c1F
: