Target
Enteropeptidase
Ligand
BDBM109658
Substrate
Meas. Tech.
Inhibition Assay
Ki
0.32±0.0 nM
Citation
 Konishi, ATokumasu, MSuzuki, TKoshiba, TOhsumi, KIkehara, OKodama, Y Heteroarylcarboxylic acid ester derivative US Patent  US8609715 Publication Date 12/17/2013 
Target
Name:
Enteropeptidase
Synonyms:
ENTK PRSS7 | TMPRSS15
Type:
Enzyme
Mol. Mass.:
112901.62
Organism:
Homo sapiens (Human)
Description:
P98073
Residue:
1019
  
Inhibitor
Name:
BDBM109658
Synonyms:
US8609715, A-66
Type:
Small organic molecule
Emp. Form.:
C20H20FN3O8
Mol. Mass.:
449.3865
SMILES:
CC(Cc1cc(co1)C(=O)Oc1ccc(cc1F)C(N)=N)C(=O)N[C@@H](CC(O)=O)C(O)=O
: