Target
Tyrosine-protein kinase ABL1
Ligand
BDBM112156
Substrate
Meas. Tech.
In Vitro Enzyme Assay
Ki
0.1±n/a nM
Citation
 Lyssikatos, JPGazzard, LJHanan, EKintz, SPurkey, HE Substituted 6,6-fused nitrogenous heterocyclic compounds and uses thereof US Patent  US8623889 Publication Date 1/7/2014 
Target
Name:
Tyrosine-protein kinase ABL1
Synonyms:
ABL ABL1_HUMAN JTK7 Proto-oncogene tyrosine-protein kinase ABL1 Tyrosine-protein kinase ABL V-abl Abelson murine leukemia viral oncogene homolog 1 p150 | tyrosine-protein kinase ABL1 isoform a
Type:
Enzyme
Mol. Mass.:
122897.30
Organism:
Homo sapiens (Human)
Description:
P00519
Residue:
1130
  
Inhibitor
Name:
BDBM112156
Synonyms:
US8623889, 154
Type:
Small organic molecule
Emp. Form.:
C19H16ClN3O
Mol. Mass.:
337.803
SMILES:
Cc1cc(Cl)ncc1-c1ccc2cc(NC(=O)C3CC3)ncc2c1
: