Target
Tyrosine-protein kinase JAK1
Ligand
BDBM113220
Substrate
Meas. Tech.
Enzymatic Assay
pH
7.4±n/a
IC50
0.00125±n/a nM
Comments
extracted
Citation
 Promo, MAXie, JAcker, BAHartmann, SJWolfson, SGHuang, HJacobsen, EJ Pyrrolo[2,3-D]pyrimidine compounds US Patent  US8633206 Publication Date 1/21/2014 
Target
Name:
Tyrosine-protein kinase JAK1
Synonyms:
JAK-1 JAK1A JAK1_HUMAN Janus kinase 1 (JAK1) | Janus kinase 1 JAK1
Type:
Protein
Mol. Mass.:
133293.73
Organism:
Homo sapiens (Human)
Description:
P23458
Residue:
1154
  
Inhibitor
Name:
BDBM113220
Synonyms:
US8633206, 139
Type:
Small organic molecule
Emp. Form.:
C22H35N5O4S
Mol. Mass.:
465.609
SMILES:
COCCOC1CCCN(C1)S(=O)(=O)C[C@H]1CC[C@@H](CC1)N(C)c1ncnc2[nH]ccc12
: