Target
Cannabinoid receptor 1
Ligand
BDBM21281
Substrate
Meas. Tech.
CB1 & 2 Binding Assays
pH
7.4±n/a
Temperature
303.15±n/a K
Ki
7.5± 2 nM
Comments
extracted
Citation
 Chicca, ACaprioglio, DMinassi, APetrucci, VAppendino, GTaglialatela-Scafati, OGertsch, J Functionalization of ß-Caryophyllene Generates Novel Polypharmacology in the Endocannabinoid System. ACS Chem Biol 9:1499-507 (2014)  
Target
Name:
Cannabinoid receptor 1
Synonyms:
CANN6 CB-R CNR CNR1_HUMAN Cannabinoid receptor Cannabinoid receptor 1 (brain)
Type:
G Protein-Coupled Receptor (GPCR)
Mol. Mass.:
52868.96
Organism:
Homo sapiens (Human)
Description:
P21554
Residue:
472
  
Inhibitor
Name:
BDBM21281
Synonyms:
(11R)-2-methyl-11-(morpholin-4-ylmethyl)-3-(naphthalen-1-ylcarbonyl)-9-oxa-1-azatricyclo[6.3.1.0^{4,12}]dodeca-2,4(12),5,7-tetraene CHEMBL188 WIN 55212-2 WIN55212-2
Type:
Analgesic
Emp. Form.:
C27H26N2O3
Mol. Mass.:
426.5069
SMILES:
Cc1c(C(=O)c2cccc3ccccc23)c2cccc3OC[C@@H](CN4CCOCC4)n1c23
: