Target
Tyrosyl-DNA phosphodiesterase 2
Ligand
BDBM33082
Substrate
Meas. Tech.
Epi Absorbance-based biochemical high throughput dose response assay to identify inhibitors of human tyrosyl-DNA phosphodiesterase 2 (TDP2)
IC50
128305±n/a nM
Citation
 PubChem, PC Epi Absorbance-based biochemical high throughput dose response assay to identify inhibitors of human tyrosyl-DNA phosphodiesterase 2 (TDP2) PubChem Bioassay (2014)[AID] 
Target
Name:
Tyrosyl-DNA phosphodiesterase 2
Synonyms:
EAP2 ETS1-associated protein 2 TDP2 TTRAP Tyr-DNA phosphodiesterase 2 Tyrosyl-DNA phosphodiesterase 2 (hTDP2) VPg unlinkase | hTDP2
Type:
Enzyme Catalytic Domain
Mol. Mass.:
40916.54
Organism:
Homo sapiens (Human)
Description:
gi_23510348
Residue:
362
  
Inhibitor
Name:
BDBM33082
Synonyms:
1,4-diketo-3-(4-methylbenzyl)naphthalene-2-carboxylic acid ethyl ester MLS000532055 cid_2841620 ethyl 3-[(4-methylphenyl)methyl]-1,4-bis(oxidanylidene)naphthalene-2-carboxylate | ethyl 3-[(4-methylphenyl)methyl]-1,4-dioxonaphthalene-2-carboxylate
Type:
Small organic molecule
Emp. Form.:
C21H18O4
Mol. Mass.:
334.3652
SMILES:
CCOC(=O)C1=C(Cc2ccc(C)cc2)C(=O)c2ccccc2C1=O
: