Target
1-phosphatidylinositol 4,5-bisphosphate phosphodiesterase gamma-1 [1-999,I813T]
Ligand
BDBM114250
Substrate
Meas. Tech.
Counterscreen for inhibitors of phospholipase C isozymes (PLC-B3): Fluorescence-based biochemical high throughput dose response assay to identify inhibitors of phospholipase C isozymes (PLC-gamma1)
IC50
122387±n/a nM
Citation
 PubChem, PC Counterscreen for inhibitors of phospholipase C isozymes (PLC-B3): Fluorescence-based biochemical high throughput dose response assay to identify inhibitors of phospholipase C isozymes (PLC-gamma1) PubChem Bioassay (2014)[AID] 
Target
Name:
1-phosphatidylinositol 4,5-bisphosphate phosphodiesterase gamma-1 [1-999,I813T]
Synonyms:
PLC1 PLCG1_HUMAN | Phospholipase C, gamma 1
Type:
Enzyme Catalytic Domain
Mol. Mass.:
115282.60
Organism:
Homo sapiens (Human)
Description:
gi_223459640
Residue:
999
  
Inhibitor
Name:
BDBM114250
Synonyms:
2-[1,3-bis(oxidanylidene)isoindol-2-yl]-N-[4-[(2,6-dimethoxypyrimidin-4-yl)sulfamoyl]phenyl]ethanamide N-(4-{[(2,6-dimethoxypyrimidin-4-yl)amino]sulfonyl}phenyl)-2-(1,3-dioxo-1,3-dihydro-2H-isoindol-2-yl)acetamide N-[4-[(2,6-dimethoxypyrimidin-4-yl)sulfamoyl]phenyl]-2-(1,3-dioxoisoindol-2-yl)acetamide SMR000312834 | cid_1562044
Type:
Small organic molecule
Emp. Form.:
C22H19N5O7S
Mol. Mass.:
497.481
SMILES:
COc1cc(NS(=O)(=O)c2ccc(NC(=O)CN3C(=O)c4ccccc4C3=O)cc2)nc(OC)n1
: