Target
1-phosphatidylinositol 4,5-bisphosphate phosphodiesterase gamma-1 [1-999,I813T]
Ligand
BDBM60205
Substrate
Meas. Tech.
Counterscreen for inhibitors of phospholipase C isozymes (PLC-B3): Fluorescence-based biochemical high throughput dose response assay to identify inhibitors of phospholipase C isozymes (PLC-gamma1)
IC50
4359±n/a nM
Citation
 PubChem, PC Counterscreen for inhibitors of phospholipase C isozymes (PLC-B3): Fluorescence-based biochemical high throughput dose response assay to identify inhibitors of phospholipase C isozymes (PLC-gamma1) PubChem Bioassay (2014)[AID] 
Target
Name:
1-phosphatidylinositol 4,5-bisphosphate phosphodiesterase gamma-1 [1-999,I813T]
Synonyms:
PLC1 PLCG1_HUMAN | Phospholipase C, gamma 1
Type:
Enzyme Catalytic Domain
Mol. Mass.:
115282.60
Organism:
Homo sapiens (Human)
Description:
gi_223459640
Residue:
999
  
Inhibitor
Name:
BDBM60205
Synonyms:
MLS001006819 N,N'-bis(4-oxidanylidene-2-sulfanylidene-1,3-thiazolidin-3-yl)ethanediamide N,N'-bis(4-oxo-2-sulfanylidene-3-thiazolidinyl)oxamide cid_2355982
Type:
Small organic molecule
Emp. Form.:
C8H6N4O4S4
Mol. Mass.:
350.418
SMILES:
Oc1csc(=S)n1NC(=O)C(=O)Nn1c(O)csc1=S
: