Target
Protein artemis
Ligand
BDBM50796
Substrate
Meas. Tech.
Dose Response confirmation of small molecule inhibitors originally identified via uHTS of Artemis endonuclease activity via a fluorescence intensity assay
IC50
6960±n/a nM
Citation
 PubChem, PC Dose Response confirmation of small molecule inhibitors originally identified via uHTS of Artemis endonuclease activity via a fluorescence intensity assay PubChem Bioassay (2013)[AID] 
Target
Name:
Protein artemis
Synonyms:
ARTEMIS DCLRE1C SCIDA protein artemis isoform a
Type:
Enzyme Catalytic Domain
Mol. Mass.:
78427.91
Organism:
Homo sapiens (Human)
Description:
gi_76496497
Residue:
692
  
Inhibitor
Name:
BDBM50796
Synonyms:
MLS000082461 N-[5-(4-methoxyphenyl)-7-phenyl-1,5,6,7-tetrahydro-[1,2,4]triazolo[1,5-a]pyrimidin-2-yl]thiophene-2-carboxamide cid_5389863
Type:
Small organic molecule
Emp. Form.:
C23H21N5O2S
Mol. Mass.:
431.51
SMILES:
COc1ccc(cc1)C1CC(c2ccccc2)n2nc(NC(=O)c3cccs3)nc2N1
: