Target
Protein artemis
Ligand
BDBM42660
Substrate
Meas. Tech.
Dose Response confirmation of small molecule inhibitors originally identified via uHTS of Artemis endonuclease activity via a fluorescence intensity assay
IC50
7660±n/a nM
Citation
 PubChem, PC Dose Response confirmation of small molecule inhibitors originally identified via uHTS of Artemis endonuclease activity via a fluorescence intensity assay PubChem Bioassay (2013)[AID] 
Target
Name:
Protein artemis
Synonyms:
ARTEMIS DCLRE1C SCIDA protein artemis isoform a
Type:
Enzyme Catalytic Domain
Mol. Mass.:
78427.91
Organism:
Homo sapiens (Human)
Description:
gi_76496497
Residue:
692
  
Inhibitor
Name:
BDBM42660
Synonyms:
6-(3-methyl-1-benzofuran-2-yl)-2-N-phenyl-1,3,5-triazine-2,4-diamine 6-(3-methyl-2-benzofuranyl)-N2-phenyl-1,3,5-triazine-2,4-diamine SMR000037465 cid_666284
Type:
Small organic molecule
Emp. Form.:
C18H15N5O
Mol. Mass.:
317.3446
SMILES:
Cc1c(oc2ccccc12)-c1nc(N)nc(Nc2ccccc2)n1
: