Target
Protein artemis
Ligand
BDBM49254
Substrate
Meas. Tech.
Dose Response confirmation of small molecule inhibitors originally identified via uHTS of Artemis endonuclease activity via a fluorescence intensity assay
IC50
11400±n/a nM
Citation
 PubChem, PC Dose Response confirmation of small molecule inhibitors originally identified via uHTS of Artemis endonuclease activity via a fluorescence intensity assay PubChem Bioassay (2013)[AID] 
Target
Name:
Protein artemis
Synonyms:
ARTEMIS DCLRE1C SCIDA protein artemis isoform a
Type:
Enzyme Catalytic Domain
Mol. Mass.:
78427.91
Organism:
Homo sapiens (Human)
Description:
gi_76496497
Residue:
692
  
Inhibitor
Name:
BDBM49254
Synonyms:
7-[2-pyridinyl(2-pyridinylamino)methyl]-8-quinolinol 7-[2-pyridyl-(2-pyridylamino)methyl]quinolin-8-ol MLS000099166 cid_630034
Type:
Small organic molecule
Emp. Form.:
C20H16N4O
Mol. Mass.:
328.3672
SMILES:
Oc1c(ccc2cccnc12)C(Nc1ccccn1)c1ccccn1
: