Target
Protein artemis
Ligand
BDBM53719
Substrate
Meas. Tech.
Dose Response confirmation of small molecule inhibitors originally identified via uHTS of Artemis endonuclease activity via a fluorescence intensity assay
IC50
1590±n/a nM
Citation
 PubChem, PC Dose Response confirmation of small molecule inhibitors originally identified via uHTS of Artemis endonuclease activity via a fluorescence intensity assay PubChem Bioassay (2013)[AID] 
Target
Name:
Protein artemis
Synonyms:
ARTEMIS DCLRE1C SCIDA protein artemis isoform a
Type:
Enzyme Catalytic Domain
Mol. Mass.:
78427.91
Organism:
Homo sapiens (Human)
Description:
gi_76496497
Residue:
692
  
Inhibitor
Name:
BDBM53719
Synonyms:
4-(4-chloranyl-2-methyl-phenoxy)-N-oxidanyl-butanamide 4-(4-chloro-2-methylphenoxy)-N-hydroxybutanamide SMR000104993 | cid_568416
Type:
Small organic molecule
Emp. Form.:
C11H14ClNO3
Mol. Mass.:
243.687
SMILES:
Cc1cc(Cl)ccc1OCCCC(=O)NO
: