Target
Protein artemis
Ligand
BDBM64842
Substrate
Meas. Tech.
Dose Response confirmation of small molecule inhibitors originally identified via uHTS of Artemis endonuclease activity via a fluorescence intensity assay
IC50
4650±n/a nM
Citation
 PubChem, PC Dose Response confirmation of small molecule inhibitors originally identified via uHTS of Artemis endonuclease activity via a fluorescence intensity assay PubChem Bioassay (2013)[AID] 
Target
Name:
Protein artemis
Synonyms:
ARTEMIS DCLRE1C SCIDA protein artemis isoform a
Type:
Enzyme Catalytic Domain
Mol. Mass.:
78427.91
Organism:
Homo sapiens (Human)
Description:
gi_76496497
Residue:
692
  
Inhibitor
Name:
BDBM64842
Synonyms:
1-[4-(2-pyridin-2-ylpyrimidin-4-yl)phenyl]benzimidazole 1-[4-[2-(2-pyridyl)pyrimidin-4-yl]phenyl]benzimidazole MLS000541326 cid_1477836
Type:
Small organic molecule
Emp. Form.:
C22H15N5
Mol. Mass.:
349.388
SMILES:
c1nc2ccccc2n1-c1ccc(cc1)-c1ccnc(n1)-c1ccccn1
: