Target
Protein artemis
Ligand
BDBM50099737
Substrate
Meas. Tech.
Dose Response confirmation of small molecule inhibitors originally identified via uHTS of Artemis endonuclease activity via a fluorescence intensity assay
IC50
630±n/a nM
Citation
 PubChem, PC Dose Response confirmation of small molecule inhibitors originally identified via uHTS of Artemis endonuclease activity via a fluorescence intensity assay PubChem Bioassay (2013)[AID] 
Target
Name:
Protein artemis
Synonyms:
ARTEMIS DCLRE1C SCIDA protein artemis isoform a
Type:
Enzyme Catalytic Domain
Mol. Mass.:
78427.91
Organism:
Homo sapiens (Human)
Description:
gi_76496497
Residue:
692
  
Inhibitor
Name:
BDBM50099737
Synonyms:
2-Amino-phenanthrene-9,10-dione US9073941, 902 | cid_254021
Type:
Small organic molecule
Emp. Form.:
C14H9NO2
Mol. Mass.:
223.2268
SMILES:
Nc1ccc-2c(c1)C(=O)C(=O)c1ccccc-21
: