Target
Protein artemis
Ligand
BDBM114687
Substrate
Meas. Tech.
Dose Response confirmation of small molecule inhibitors originally identified via uHTS of Artemis endonuclease activity via a fluorescence intensity assay
IC50
1680±n/a nM
Citation
 PubChem, PC Dose Response confirmation of small molecule inhibitors originally identified via uHTS of Artemis endonuclease activity via a fluorescence intensity assay PubChem Bioassay (2013)[AID] 
Target
Name:
Protein artemis
Synonyms:
ARTEMIS DCLRE1C SCIDA protein artemis isoform a
Type:
Enzyme Catalytic Domain
Mol. Mass.:
78427.91
Organism:
Homo sapiens (Human)
Description:
gi_76496497
Residue:
692
  
Inhibitor
Name:
BDBM114687
Synonyms:
6-(4,5-Dihydro-thiazol-2-ylsulfanyl)-N,N'-bis-(4-methoxy-phenyl)-[1,3,5]triazine-2,4-diamine 6-(4,5-dihydro-1,3-thiazol-2-ylsulfanyl)-N2,N4-bis(4-methoxyphenyl)-1,3,5-triazine-2,4-diamine;methanol MLS000555004 cid_9550077 | methanol;(4-methoxyphenyl)-[4-(p-anisidino)-6-(2-thiazolin-2-ylthio)-s-triazin-2-yl]amine
Type:
Small organic molecule
Emp. Form.:
C20H20N6O2S2
Mol. Mass.:
440.542
SMILES:
COc1ccc(Nc2nc(Nc3ccc(OC)cc3)nc(SC3=NCCS3)n2)cc1
: