Target
Protein artemis
Ligand
BDBM48241
Substrate
Meas. Tech.
Dose Response confirmation of small molecule inhibitors originally identified via uHTS of Artemis endonuclease activity via a fluorescence intensity assay
IC50
5840±n/a nM
Citation
 PubChem, PC Dose Response confirmation of small molecule inhibitors originally identified via uHTS of Artemis endonuclease activity via a fluorescence intensity assay PubChem Bioassay (2013)[AID] 
Target
Name:
Protein artemis
Synonyms:
ARTEMIS DCLRE1C SCIDA protein artemis isoform a
Type:
Enzyme Catalytic Domain
Mol. Mass.:
78427.91
Organism:
Homo sapiens (Human)
Description:
gi_76496497
Residue:
692
  
Inhibitor
Name:
BDBM48241
Synonyms:
(E)-[1-[4-(2,4-dichlorobenzyl)oxyphenyl]-2,5-dimethyl-pyrrol-3-yl]methylene-(1,2,4-triazol-4-yl)amine 1-[1-[4-[(2,4-dichlorophenyl)methoxy]phenyl]-2,5-dimethyl-pyrrol-3-yl]-N-(1,2,4-triazol-4-yl)methanimine MLS000534387 SMR000141819 cid_1317430
Type:
Small organic molecule
Emp. Form.:
C22H19Cl2N5O
Mol. Mass.:
440.325
SMILES:
Cc1cc(C=Nn2cnnc2)c(C)n1-c1ccc(OCc2ccc(Cl)cc2Cl)cc1
: