Target
Protein artemis
Ligand
BDBM66045
Substrate
Meas. Tech.
Dose Response confirmation of small molecule inhibitors originally identified via uHTS of Artemis endonuclease activity via a fluorescence intensity assay
IC50
11000±n/a nM
Citation
 PubChem, PC Dose Response confirmation of small molecule inhibitors originally identified via uHTS of Artemis endonuclease activity via a fluorescence intensity assay PubChem Bioassay (2013)[AID] 
Target
Name:
Protein artemis
Synonyms:
ARTEMIS DCLRE1C SCIDA protein artemis isoform a
Type:
Enzyme Catalytic Domain
Mol. Mass.:
78427.91
Organism:
Homo sapiens (Human)
Description:
gi_76496497
Residue:
692
  
Inhibitor
Name:
BDBM66045
Synonyms:
(2E)-2-(1-nitrosodecylidene)-1H-pyridine MLS000555881 cid_5937406
Type:
Small organic molecule
Emp. Form.:
C15H24N2O
Mol. Mass.:
248.3639
SMILES:
CCCCCCCCCC(N=O)c1ccccn1
: