Target
Protein artemis
Ligand
BDBM34691
Substrate
Meas. Tech.
Dose Response confirmation of small molecule inhibitors originally identified via uHTS of Artemis endonuclease activity via a fluorescence intensity assay
IC50
1480±n/a nM
Citation
 PubChem, PC Dose Response confirmation of small molecule inhibitors originally identified via uHTS of Artemis endonuclease activity via a fluorescence intensity assay PubChem Bioassay (2013)[AID] 
Target
Name:
Protein artemis
Synonyms:
ARTEMIS DCLRE1C SCIDA protein artemis isoform a
Type:
Enzyme Catalytic Domain
Mol. Mass.:
78427.91
Organism:
Homo sapiens (Human)
Description:
gi_76496497
Residue:
692
  
Inhibitor
Name:
BDBM34691
Synonyms:
2-methyl-3-(phenylcarbonyl)benzo[g][1]benzofuran-4,5-dione 3-benzoyl-2-methyl-benzo[g]benzofuran-4,5-quinone 3-benzoyl-2-methylbenzo[g]benzofuran-4,5-dione SMR000146422 | cid_3816369
Type:
Small organic molecule
Emp. Form.:
C20H12O4
Mol. Mass.:
316.3069
SMILES:
Cc1oc-2c(c1C(=O)c1ccccc1)C(=O)C(=O)c1ccccc-21
: