Target
Protein artemis
Ligand
BDBM41832
Substrate
Meas. Tech.
Dose Response confirmation of small molecule inhibitors originally identified via uHTS of Artemis endonuclease activity via a fluorescence intensity assay
IC50
7400±n/a nM
Citation
 PubChem, PC Dose Response confirmation of small molecule inhibitors originally identified via uHTS of Artemis endonuclease activity via a fluorescence intensity assay PubChem Bioassay (2013)[AID] 
Target
Name:
Protein artemis
Synonyms:
ARTEMIS DCLRE1C SCIDA protein artemis isoform a
Type:
Enzyme Catalytic Domain
Mol. Mass.:
78427.91
Organism:
Homo sapiens (Human)
Description:
gi_76496497
Residue:
692
  
Inhibitor
Name:
BDBM41832
Synonyms:
Acetic acid N'-[3-oxo-3H-benzo[b]thiophen-(2Z)-ylidene]-N-o-tolyl-hydrazide N-(2-methylphenyl)-N-[(3-oxidanylidene-1-benzothiophen-2-ylidene)amino]ethanamide N-[(3-ketobenzothiophen-2-ylidene)amino]-N-(o-tolyl)acetamide SMR000146277 | cid_759936
Type:
Small organic molecule
Emp. Form.:
C17H14N2O2S
Mol. Mass.:
310.37
SMILES:
CC(=O)N(N=C1Sc2ccccc2C1=O)c1ccccc1C
: