Target
Protein artemis
Ligand
BDBM52343
Substrate
Meas. Tech.
Dose Response confirmation of small molecule inhibitors originally identified via uHTS of Artemis endonuclease activity via a fluorescence intensity assay
IC50
1500±n/a nM
Citation
 PubChem, PC Dose Response confirmation of small molecule inhibitors originally identified via uHTS of Artemis endonuclease activity via a fluorescence intensity assay PubChem Bioassay (2013)[AID] 
Target
Name:
Protein artemis
Synonyms:
ARTEMIS DCLRE1C SCIDA protein artemis isoform a
Type:
Enzyme Catalytic Domain
Mol. Mass.:
78427.91
Organism:
Homo sapiens (Human)
Description:
gi_76496497
Residue:
692
  
Inhibitor
Name:
BDBM52343
Synonyms:
(5Z)-3-allyl-5-(2-methyl-4-morpholino-benzylidene)thiazolidine-2,4-quinone (5Z)-5-[(2-methyl-4-morpholin-4-ylphenyl)methylidene]-3-prop-2-enyl-1,3-thiazolidine-2,4-dione 3-allyl-5-[2-methyl-4-(4-morpholinyl)benzylidene]-1,3-thiazolidine-2,4-dione SMR000163832 | cid_1210145
Type:
Small organic molecule
Emp. Form.:
C18H20N2O3S
Mol. Mass.:
344.428
SMILES:
Cc1cc(ccc1\C=C1/SC(=O)N(CC=C)C1=O)N1CCOCC1
: