Target
Protein artemis
Ligand
BDBM114701
Substrate
Meas. Tech.
Dose Response confirmation of small molecule inhibitors originally identified via uHTS of Artemis endonuclease activity via a fluorescence intensity assay
IC50
2650±n/a nM
Citation
 PubChem, PC Dose Response confirmation of small molecule inhibitors originally identified via uHTS of Artemis endonuclease activity via a fluorescence intensity assay PubChem Bioassay (2013)[AID] 
Target
Name:
Protein artemis
Synonyms:
ARTEMIS DCLRE1C SCIDA protein artemis isoform a
Type:
Enzyme Catalytic Domain
Mol. Mass.:
78427.91
Organism:
Homo sapiens (Human)
Description:
gi_76496497
Residue:
692
  
Inhibitor
Name:
BDBM114701
Synonyms:
2-N-[(E)-benzylideneamino]-6-N-(furan-2-ylmethyl)-4-N-(4-methoxyphenyl)-1,3,5-triazine-2,4,6-triamine MLS000562699 N6-(furan-2-ylmethyl)-N4-(4-methoxyphenyl)-N2-[(E)-(phenylmethylidene)amino]-1,3,5-triazine-2,4,6-triamine [(E)-benzalamino]-[4-(2-furfurylamino)-6-(p-anisidino)-s-triazin-2-yl]amine | cid_5334418
Type:
Small organic molecule
Emp. Form.:
C22H21N7O2
Mol. Mass.:
415.4478
SMILES:
COc1ccc(Nc2nc(NCc3ccco3)nc(N=NCc3ccccc3)n2)cc1
: