Target
Protein artemis
Ligand
BDBM38902
Substrate
Meas. Tech.
Dose Response confirmation of small molecule inhibitors originally identified via uHTS of Artemis endonuclease activity via a fluorescence intensity assay
IC50
3590±n/a nM
Citation
 PubChem, PC Dose Response confirmation of small molecule inhibitors originally identified via uHTS of Artemis endonuclease activity via a fluorescence intensity assay PubChem Bioassay (2013)[AID] 
Target
Name:
Protein artemis
Synonyms:
ARTEMIS DCLRE1C SCIDA protein artemis isoform a
Type:
Enzyme Catalytic Domain
Mol. Mass.:
78427.91
Organism:
Homo sapiens (Human)
Description:
gi_76496497
Residue:
692
  
Inhibitor
Name:
BDBM38902
Synonyms:
4-(4-phenyl-1-piperazinyl)-2-(2-pyridinyl)quinazoline 4-(4-phenylpiperazin-1-yl)-2-pyridin-2-ylquinazoline MLS000036745 cid_661691
Type:
Small organic molecule
Emp. Form.:
C23H21N5
Mol. Mass.:
367.4463
SMILES:
C1CN(CCN1c1ccccc1)c1nc(nc2ccccc12)-c1ccccn1
: