Target
Protein artemis
Ligand
BDBM37320
Substrate
Meas. Tech.
Dose Response confirmation of small molecule inhibitors originally identified via uHTS of Artemis endonuclease activity via a fluorescence intensity assay
IC50
15000±n/a nM
Citation
 PubChem, PC Dose Response confirmation of small molecule inhibitors originally identified via uHTS of Artemis endonuclease activity via a fluorescence intensity assay PubChem Bioassay (2013)[AID] 
Target
Name:
Protein artemis
Synonyms:
ARTEMIS DCLRE1C SCIDA protein artemis isoform a
Type:
Enzyme Catalytic Domain
Mol. Mass.:
78427.91
Organism:
Homo sapiens (Human)
Description:
gi_76496497
Residue:
692
  
Inhibitor
Name:
BDBM37320
Synonyms:
1-[[2-(3,5-dimethyl-1-pyrazolyl)-5,6,7,8-tetrahydro-[1]benzothiolo[2,3-d]pyrimidin-4-yl]amino]-2-propanol 1-[[2-(3,5-dimethylpyrazol-1-yl)-5,6,7,8-tetrahydrobenzothiopheno[2,3-d]pyrimidin-4-yl]amino]propan-2-ol SMR000046819 | cid_665642
Type:
Small organic molecule
Emp. Form.:
C18H23N5OS
Mol. Mass.:
357.473
SMILES:
CC(O)CNc1nc(nc2sc3CCCCc3c12)-n1nc(C)cc1C
: