Target
Protein artemis
Ligand
BDBM114713
Substrate
Meas. Tech.
Dose Response confirmation of small molecule inhibitors originally identified via uHTS of Artemis endonuclease activity via a fluorescence intensity assay
IC50
11800±n/a nM
Citation
 PubChem, PC Dose Response confirmation of small molecule inhibitors originally identified via uHTS of Artemis endonuclease activity via a fluorescence intensity assay PubChem Bioassay (2013)[AID] 
Target
Name:
Protein artemis
Synonyms:
ARTEMIS DCLRE1C SCIDA protein artemis isoform a
Type:
Enzyme Catalytic Domain
Mol. Mass.:
78427.91
Organism:
Homo sapiens (Human)
Description:
gi_76496497
Residue:
692
  
Inhibitor
Name:
BDBM114713
Synonyms:
MLS002583624 N-[5-(4-chlorophenyl)-7-(4-methoxyphenyl)-1,5,6,7-tetrahydro-[1,2,4]triazolo[1,5-a]pyrimidin-2-yl]-2-furancarboxamide SMR000046689 | cid_5389943
Type:
Small organic molecule
Emp. Form.:
C23H20ClN5O3
Mol. Mass.:
449.89
SMILES:
COc1ccc(cc1)C1CC(Nc2nc(NC(=O)c3ccco3)nn12)c1ccc(Cl)cc1
: