Target
Tegument protein VP16
Ligand
BDBM100228
Substrate
Meas. Tech.
Counterscreen for inhibitors of COUP-TFII (NR2F2): Luminescence-based cell-based high throughput dose response assay to identify inhibitors of the Herpes Virus Virion Protein 16 (VP16)
IC50
50274±n/a nM
Citation
 PubChem, PC Counterscreen for inhibitors of COUP-TFII (NR2F2): Luminescence-based cell-based high throughput dose response assay to identify inhibitors of the Herpes Virus Virion Protein 16 (VP16) PubChem Bioassay (2013)[AID] 
Target
Name:
Tegument protein VP16
Synonyms:
Alpha trans-inducing protein (VP16) transactivating tegument protein VP16
Type:
PROTEIN
Mol. Mass.:
54325.13
Organism:
Human herpesvirus 1 (strain 17) (HHV-1) (Human herpes simplex virus1)
Description:
EBI_100271
Residue:
490
  
Inhibitor
Name:
BDBM100228
Synonyms:
4-(cyclopentylamino)-2-(3,5-dimethyl-1-pyrazolyl)-5-pyrimidinecarboxylic acid ethyl ester 4-Cyclopentylamino-2-(3,5-dimethyl-pyrazol-1-yl)-pyrimidine-5-carboxylic acid ethyl ester SMR000436423 ethyl 4-(cyclopentylamino)-2-(3,5-dimethylpyrazol-1-yl)pyrimidine-5-carboxylate
Type:
Small organic molecule
Emp. Form.:
C17H23N5O2
Mol. Mass.:
329.3968
SMILES:
CCOC(=O)c1cnc(nc1NC1CCCC1)-n1nc(C)cc1C
: