Target
Aldehyde dehydrogenase, mitochondrial
Ligand
BDBM118222
Substrate
Meas. Tech.
ALDH2 Assay
pH
7.4±n/a
IC50
15±n/a nM
Comments
extracted
Citation
 Graupe, MVenkataramani, CZablocki, J ALDH-2 inhibitors in the treatment of addiction US Patent  US8673966 Publication Date 3/18/2014 
Target
Name:
Aldehyde dehydrogenase, mitochondrial
Synonyms:
ALDH class 2 ALDH2 ALDHI Aldehyde dehydrogenase (ALDH2)
Type:
Enzyme
Mol. Mass.:
56382.67
Organism:
Homo sapiens (Human)
Description:
P05091
Residue:
517
  
Inhibitor
Name:
BDBM118222
Synonyms:
US8673966, N-(4-(7-((1-(2-hydroxyacetyl)azetidin-3- yl)ethynyl)-4-oxo-4H-chromen-3-yl)phenyl)methanesulfonamide
Type:
Emp. Form.:
C23H20N2O6S
Mol. Mass.:
452.48
SMILES:
CS(=O)(=O)Nc1ccc(cc1)-c1coc2cc(ccc2c1=O)C#CC1CN(C1)C(=O)CO
: