Target
UDP-N-acetylmuramoylalanine--D-glutamate ligase
Ligand
BDBM119100
Substrate
IC50
8.4e+3±n/a nM
Citation
 Hrast, MSosic, ISink, RGobec, S Inhibitors of the peptidoglycan biosynthesis enzymes MurA-F. Bioorg Chem 55:2-15 (2014)  
Target
Name:
UDP-N-acetylmuramoylalanine--D-glutamate ligase
Synonyms:
D-glutamic acid-adding enzyme MurD (E. coli) UDP-N-acetylmuramoyl-L-alanyl-D-glutamate synthetase | murD
Type:
Ligase
Mol. Mass.:
46963.02
Organism:
Escherichia coli (strain K12)
Description:
Residue:
438
  
Inhibitor
Name:
BDBM119100
Synonyms:
MurD inhibitor (compound 42)
Type:
Small organic molecule
Emp. Form.:
C26H17FN2O7S
Mol. Mass.:
520.486
SMILES:
OC(=O)c1ccc(NS(=O)(=O)c2ccc3cc(OCc4ccc(cc4F)C#N)ccc3c2)c(c1)C(O)=O
: