Target
UDP-N-acetylmuramoylalanine--D-glutamate ligase
Ligand
BDBM119105
Substrate
IC50
1.0e+4±n/a nM
Citation
 Hrast, MSosic, ISink, RGobec, S Inhibitors of the peptidoglycan biosynthesis enzymes MurA-F. Bioorg Chem 55:2-15 (2014)  
Target
Name:
UDP-N-acetylmuramoylalanine--D-glutamate ligase
Synonyms:
D-glutamic acid-adding enzyme MurD (E. coli) UDP-N-acetylmuramoyl-L-alanyl-D-glutamate synthetase | murD
Type:
Ligase
Mol. Mass.:
46963.02
Organism:
Escherichia coli (strain K12)
Description:
Residue:
438
  
Inhibitor
Name:
BDBM119105
Synonyms:
MurD inhibitor (compound 47)
Type:
Small organic molecule
Emp. Form.:
C16H14N2O6S2
Mol. Mass.:
394.422
SMILES:
OC(=O)CC[C@H](NC(=O)c1ccc(C=C2SC(O)=NC2=S)cc1)C(O)=O
: