Target
UDP-N-acetylmuramoylalanine--D-glutamate ligase
Ligand
BDBM119107
Substrate
IC50
8.2e+3±n/a nM
Citation
 Hrast, MSosic, ISink, RGobec, S Inhibitors of the peptidoglycan biosynthesis enzymes MurA-F. Bioorg Chem 55:2-15 (2014)  
Target
Name:
UDP-N-acetylmuramoylalanine--D-glutamate ligase
Synonyms:
D-glutamic acid-adding enzyme MurD (E. coli) UDP-N-acetylmuramoyl-L-alanyl-D-glutamate synthetase | murD
Type:
Ligase
Mol. Mass.:
46963.02
Organism:
Escherichia coli (strain K12)
Description:
Residue:
438
  
Inhibitor
Name:
BDBM119107
Synonyms:
MurD/E inhibitor (compound 49)
Type:
Small organic molecule
Emp. Form.:
C23H21N3O6S2
Mol. Mass.:
499.559
SMILES:
OC(=O)CC[C@@H](NC(=O)c1cccc(NCc2ccc(C=C3SC(S)=NC3=O)cc2)c1)C(O)=O
: