Target
UDP-N-acetylmuramoylalanine--D-glutamate ligase
Ligand
BDBM85276
Substrate
IC50
1.8e+4±n/a nM
Citation
 Hrast, MSosic, ISink, RGobec, S Inhibitors of the peptidoglycan biosynthesis enzymes MurA-F. Bioorg Chem 55:2-15 (2014)  
Target
Name:
UDP-N-acetylmuramoylalanine--D-glutamate ligase
Synonyms:
D-glutamic acid-adding enzyme MurD (E. coli) UDP-N-acetylmuramoyl-L-alanyl-D-glutamate synthetase | murD
Type:
Ligase
Mol. Mass.:
46963.02
Organism:
Escherichia coli (strain K12)
Description:
Residue:
438
  
Inhibitor
Name:
BDBM85276
Synonyms:
HEA derivative, 7c | MurC/D/E/F inhibitor (compound 68)
Type:
Small organic molecule
Emp. Form.:
C14H20F3N2O7PS
Mol. Mass.:
448.352
SMILES:
OP(O)(=O)OC(CNS(=O)(=O)c1ccc(cc1)C(F)(F)F)CN1CCOCC1
: