Target
N-lysine methyltransferase SMYD2
Ligand
BDBM283197
Substrate
Meas. Tech.
Scintillation Proximity Assay (SPA) for Detection of SMYD2 Enzymatic Inhibition
pH
9±n/a
IC50
26.1±n/a nM
Comments
extracted
Citation
 Mowat, JSStellfeld, TStresemann, CHillig, RKöhr, SStöckigt, DWeiske, JBrumby, TBarak, NChrist, CTer Laak, ABadock, VCrampton, RHStefanuti, I Aryl-cyanoguanidine compounds US Patent  US10023539 Publication Date 7/17/2018 
Target
Name:
N-lysine methyltransferase SMYD2
Synonyms:
HSKM-B KMT3C N-lysine methyltransferase SMYD2 SET and MYND domain-containing protein 2 (SMYD2) SMYD2_HUMAN
Type:
Enzyme
Mol. Mass.:
49689.57
Organism:
Homo sapiens (Human)
Description:
Q9NRG4
Residue:
433
  
Inhibitor
Name:
BDBM283197
Synonyms:
Rac-N-[1-(N′-cyano-N-{2-[(1-methylpiperidin-4-yl)oxy]-5-(trifluoromethyl)phenyl}-carbamimidoyl)-3-(3,4-dichlorophenyl)-4,5-dihydro-1H-pyrazol-4-yl]-N-ethyl-2-hydroxyacetamide | US10023539, Example 32
Type:
Small organic molecule
Emp. Form.:
C28H30Cl2F3N7O4
Mol. Mass.:
656.484
SMILES:
CCN(C1CN(N=C1c1ccc(Cl)c(Cl)c1)C(\Nc1cc(ccc1OCCN1CCOCC1)C(F)(F)F)=N/C#N)C(=O)CO
: