Target
Matrix metalloproteinase-14 [1-20,P8S]
Ligand
BDBM120254
Substrate
Meas. Tech.
Inhibition Assay
Ki
>1000±n/a nM
Citation
 Devel, LBeau, FCzarny, BDive, V Pseudodipeptides as MMP inhibitors US Patent  US8691753 Publication Date 4/8/2014 
Target
Name:
Matrix metalloproteinase-14 [1-20,P8S]
Synonyms:
MMP-14 MMP14 MT-MMP 1 MT1MMP Matrix metalloproteinase 14 Membrane-type matrix metalloproteinase 1 | Membrane-type-1 matrix metalloproteinase
Type:
Protein
Mol. Mass.:
2138.64
Organism:
Homo sapiens (Human)
Description:
Q8IXG1
Residue:
20
  
Inhibitor
Name:
BDBM120254
Synonyms:
US8691753, 103
Type:
Small organic molecule
Emp. Form.:
C30H33N3O7S
Mol. Mass.:
579.664
SMILES:
NC(=O)[C@H](CCCC(O)=O)NC(=O)[C@H](CCC(O)=O)NC(=O)CCc1ccc(cc1)-c1cc(cs1)-c1ccccc1
: