Target
Serine/threonine-protein kinase mTOR
Ligand
BDBM119531
Substrate
Meas. Tech.
LanthaScreen Kinase Assay
Temperature
298.15±n/a K
IC50
<10000±n/a nM
Comments
extracted
Citation
 Jessen, KGuo, XRen, PRommel, CLiu, Y Combination of kinase inhibitors and uses thereof US Patent  US9682141 Publication Date 6/20/2017 
Target
Name:
Serine/threonine-protein kinase mTOR
Synonyms:
FK506-binding protein 12-rapamycin complex-associated protein 1 FRAP FRAP1 MTOR Mammalian Target of Rapamycin (mTOR) RAFT1 Rapamycin and FKBP12 target 1 Serine/threonine-protein kinase (mTOR) | mTORC2
Type:
Rapamycin target protein
Mol. Mass.:
288917.12
Organism:
Homo sapiens (Human)
Description:
P42345
Residue:
2549
  
Inhibitor
Name:
BDBM119531
Synonyms:
US11547697, Compound 529 US9682141, 54
Type:
Small organic molecule
Emp. Form.:
C19H17N5O3
Mol. Mass.:
363.37
SMILES:
Nc1nc2cc(ccc2o1)-c1ccc2ncc(C(=O)N3CCOCC3)n2c1
: