Target
Phosphatidylinositol 3-kinase regulatory subunit alpha
Ligand
BDBM119531
Substrate
Meas. Tech.
PI 3-Kinase HTRF Assay
Temperature
298.15±n/a K
IC50
<1000±n/a nM
Comments
extracted
Citation
 Jessen, KGuo, XRen, PRommel, CLiu, Y Combination of kinase inhibitors and uses thereof US Patent  US9682141 Publication Date 6/20/2017 
Target
Name:
Phosphatidylinositol 3-kinase regulatory subunit alpha
Synonyms:
GRB1 PI3-kinase class I PI3-kinase p85-alpha subunit PI3-kinase subunit p85-alpha PIK3CG/PIK3R1 Phosphatidylinositol 3-kinase 85 kDa regulatory subunit alpha (PI3K alpha) Phosphatidylinositol 3-kinase regulatory subunit alpha (PIK3R1) Phosphatidylinositol 3-kinase regulatory subunit alpha isoform 1 (PI3 Kinase alpha) Phosphatidylinositol 4,5-bisphosphate 3-kinase catalytic subunit alpha isoform (PI3Kalpha) PtdIns-3-kinase p85-alpha p85 alpha
Type:
Protein
Mol. Mass.:
83592.82
Organism:
Homo sapiens (Human)
Description:
P27986
Residue:
724
  
Inhibitor
Name:
BDBM119531
Synonyms:
US11547697, Compound 529 US9682141, 54
Type:
Small organic molecule
Emp. Form.:
C19H17N5O3
Mol. Mass.:
363.37
SMILES:
Nc1nc2cc(ccc2o1)-c1ccc2ncc(C(=O)N3CCOCC3)n2c1
: